Reaction Details
TargetMu-type opioid receptor
LigandBDBM50105065
Substrate/Competitorn/a
Meas. Tech.ChEMBL_149489 (CHEMBL757060)
IC50>10000±n/a nM
Citation Poulain, RHorvath, DBonnet, BEckhoff, CChapelain, BBodinier, MCDéprez, B From hit to lead. Combining two complementary methods for focused library design. Application to mu opiate ligands. J Med Chem44:3378-90 (2001) Mu-type opioid receptor
Name:Mu-type opioid receptor
Type:G Protein-Coupled Receptor (GPCR)
Mol. Mass.:44789.51
Organism:Homo sapiens (Human)
Description:P35372
Residue:400
BDBM50105065
NameBDBM50105065
Synonyms:4-(2-Oxo-2,3-dihydro-benzoimidazol-1-yl)-3,6-dihydro-2H-pyridine-1-carboxylic acid 6-nitro-benzo[1,3]dioxol-5-ylmethyl ester | CHEMBL114940
TypeSmall organic molecule
Emp. Form.C21H18N4O7
Mol. Mass.438.3902
SMILES[O-][N+](=O)c1cc2OCOc2cc1COC(=O)N1CCC(=CC1)n1[c-]2ccccc2nc1=[OH+]