Reaction Details
TargetKappa-type opioid receptor
LigandBDBM50105077
Substrate/Competitorn/a
Meas. Tech.ChEMBL_145105 (CHEMBL751989)
IC50 2235±n/a nM
Citation Poulain, RHorvath, DBonnet, BEckhoff, CChapelain, BBodinier, MCDéprez, B From hit to lead. Combining two complementary methods for focused library design. Application to mu opiate ligands. J Med Chem44:3378-90 (2001) Kappa-type opioid receptor
Name:Kappa-type opioid receptor
Type:G Protein-Coupled Receptor (GPCR)
Mol. Mass.:42648.76
Organism:Homo sapiens (Human)
Description:P41145
Residue:380
BDBM50105077
NameBDBM50105077
Synonyms:4-Oxo-1-phenyl-1,3,8-triaza-spiro[4.5]decane-8-carboxylic acid benzo[1,3]dioxol-5-ylmethyl ester | CHEMBL420500
TypeSmall organic molecule
Emp. Form.C22H23N3O5
Mol. Mass.409.4351
SMILESO=C(OCc1ccc2OCOc2c1)N1CCC2(CC1)N(CNC2=O)c1ccccc1