Reaction Details
TargetKappa-type opioid receptor
LigandBDBM50105075
Substrate/Competitorn/a
Meas. Tech.ChEMBL_145105 (CHEMBL751989)
IC50 797±n/a nM
Citation Poulain, RHorvath, DBonnet, BEckhoff, CChapelain, BBodinier, MCDéprez, B From hit to lead. Combining two complementary methods for focused library design. Application to mu opiate ligands. J Med Chem44:3378-90 (2001) Kappa-type opioid receptor
Name:Kappa-type opioid receptor
Type:G Protein-Coupled Receptor (GPCR)
Mol. Mass.:42648.76
Organism:Homo sapiens (Human)
Description:P41145
Residue:380
BDBM50105075
NameBDBM50105075
Synonyms:4-(6-Methyl-2-oxo-2,3-dihydro-benzoimidazol-1-yl)-piperidine-1-carboxylic acid 6-chloro-benzo[1,3]dioxol-5-ylmethyl ester | CHEMBL326320
TypeSmall organic molecule
Emp. Form.C22H22ClN3O5
Mol. Mass.443.88
SMILESCc1ccc2[nH]c(=O)n(C3CCN(CC3)C(=O)OCc3cc4OCOc4cc3Cl)c2c1