Reaction Details
TargetMu-type opioid receptor
LigandBDBM50105084
Substrate/Competitorn/a
Meas. Tech.ChEMBL_149489 (CHEMBL757060)
IC50>10000±n/a nM
Citation Poulain, RHorvath, DBonnet, BEckhoff, CChapelain, BBodinier, MCDéprez, B From hit to lead. Combining two complementary methods for focused library design. Application to mu opiate ligands. J Med Chem44:3378-90 (2001) Mu-type opioid receptor
Name:Mu-type opioid receptor
Type:G Protein-Coupled Receptor (GPCR)
Mol. Mass.:44789.51
Organism:Homo sapiens (Human)
Description:P35372
Residue:400
BDBM50105084
NameBDBM50105084
Synonyms:4-Oxo-1-phenyl-1,3,8-triaza-spiro[4.5]decane-8-carboxylic acid 3-phenoxy-benzyl ester | CHEMBL326538
TypeSmall organic molecule
Emp. Form.C27H27N3O4
Mol. Mass.457.521
SMILESO=C(OCc1cccc(Oc2ccccc2)c1)N1CCC2(CC1)N(CNC2=O)c1ccccc1