Reaction Details
TargetMu-type opioid receptor
LigandBDBM50105099
Substrate/Competitorn/a
Meas. Tech.ChEMBL_149489 (CHEMBL757060)
IC50 1730±n/a nM
Citation Poulain, RHorvath, DBonnet, BEckhoff, CChapelain, BBodinier, MCDéprez, B From hit to lead. Combining two complementary methods for focused library design. Application to mu opiate ligands. J Med Chem44:3378-90 (2001) Mu-type opioid receptor
Name:Mu-type opioid receptor
Type:G Protein-Coupled Receptor (GPCR)
Mol. Mass.:44789.51
Organism:Homo sapiens (Human)
Description:P35372
Residue:400
BDBM50105099
NameBDBM50105099
Synonyms:4-Oxo-1-phenyl-1,3,8-triaza-spiro[4.5]decane-8-carboxylic acid 6-chloro-benzo[1,3]dioxol-5-ylmethyl ester | CHEMBL115076
TypeSmall organic molecule
Emp. Form.C22H22ClN3O5
Mol. Mass.443.88
SMILESClc1cc2OCOc2cc1COC(=O)N1CCC2(CC1)N(CNC2=O)c1ccccc1