Reaction Details
TargetMu-type opioid receptor
LigandBDBM50105089
Substrate/Competitorn/a
Meas. Tech.ChEMBL_149489 (CHEMBL757060)
IC50 17±n/a nM
Citation Poulain, RHorvath, DBonnet, BEckhoff, CChapelain, BBodinier, MCDéprez, B From hit to lead. Combining two complementary methods for focused library design. Application to mu opiate ligands. J Med Chem44:3378-90 (2001) Mu-type opioid receptor
Name:Mu-type opioid receptor
Type:G Protein-Coupled Receptor (GPCR)
Mol. Mass.:44789.51
Organism:Homo sapiens (Human)
Description:P35372
Residue:400
BDBM50105089
NameBDBM50105089
Synonyms:8-Benzo[1,3]dioxol-5-ylmethyl-1-phenyl-1,3,8-triaza-spiro[4.5]decan-4-one | CHEMBL326962
TypeSmall organic molecule
Emp. Form.C21H23N3O3
Mol. Mass.365.4256
SMILESO=C1NCN(c2ccccc2)C11CCN(Cc2ccc3OCOc3c2)CC1