Reaction Details
TargetMu-type opioid receptor
LigandBDBM50105072
Substrate/Competitorn/a
Meas. Tech.ChEMBL_149489 (CHEMBL757060)
IC50 2±n/a nM
Citation Poulain, RHorvath, DBonnet, BEckhoff, CChapelain, BBodinier, MCDéprez, B From hit to lead. Combining two complementary methods for focused library design. Application to mu opiate ligands. J Med Chem44:3378-90 (2001) Mu-type opioid receptor
Name:Mu-type opioid receptor
Type:G Protein-Coupled Receptor (GPCR)
Mol. Mass.:44789.51
Organism:Homo sapiens (Human)
Description:P35372
Residue:400
BDBM50105072
NameBDBM50105072
Synonyms:8-(6-Chloro-benzo[1,3]dioxol-5-ylmethyl)-1-phenyl-1,3,8-triaza-spiro[4.5]decan-4-one | CHEMBL115652
TypeSmall organic molecule
Emp. Form.C21H22ClN3O3
Mol. Mass.399.871
SMILESClc1cc2OCOc2cc1CN1CCC2(CC1)N(CNC2=O)c1ccccc1