Reaction Details
TargetVoltage-dependent L-type calcium channel subunit alpha-1C/alpha-1D/alpha-1F/alpha-1S
LigandBDBM50105066
Substrate/Competitorn/a
Meas. Tech.ChEMBL_92939 (CHEMBL700953)
IC50 1710±n/a nM
Citation Poulain, RHorvath, DBonnet, BEckhoff, CChapelain, BBodinier, MCDéprez, B From hit to lead. Analyzing structure-profile relationships. J Med Chem44:3391-401 (2001) Voltage-dependent L-type calcium channel subunit alpha-1C/alpha-1D/alpha-1F/alpha-1S
Name:Voltage-dependent L-type calcium channel subunit alpha-1C/alpha-1D/alpha-1F/alpha-1S
Synonyms:Voltage-gated L-type calcium channel
Type:n/a
Mol. Mass.:n/a
Description:ASSAY_ID of ChEMBL is 92767
Components:This complex has 4 components.
Component 1
Name:Voltage-dependent L-type calcium channel subunit alpha-1D
Type:PROTEIN
Mol. Mass.:245144.84
Organism:Homo sapiens (Human)
Description:ChEMBL_1350501
Residue:2161
Component 2
Name:Voltage-dependent L-type calcium channel subunit alpha-1C
Synonyms:CAC1C_HUMAN CACN2 CACNL1A1 Calcium channel (Type L) L-type calcium channel alpha-1c/beta-2/alpha2delta-1 Voltage-gated L-type calcium channel Voltage-gated calcium channel | Voltage-gated calcium channel subunit alpha Cav1.2
Type:Enzyme Catalytic Domain
Mol. Mass.:248979.79
Organism:Homo sapiens (Human)
Description:Calcium channel (Type L) 0 HUMAN::Q13936
Residue:2221
Component 3
Name:Voltage-dependent L-type calcium channel subunit alpha-1S
Synonyms:CAC1S_HUMAN CACN1 CACNL1A3 Voltage-dependent L-type calcium channel subunit alpha-1S Voltage-gated L-type calcium channel alpha-1S subunit Voltage-gated calcium channel subunit alpha Cav1.1
Type:PROTEIN
Mol. Mass.:212348.33
Organism:Homo sapiens (Human)
Description:ChEMBL_42767
Residue:1873
Component 4
Name:Voltage-dependent L-type calcium channel subunit alpha-1F
Synonyms:CAC1F_HUMAN CACNAF1 Voltage-gated calcium channel | Voltage-gated calcium channel subunit alpha Cav1.4
Type:PROTEIN
Mol. Mass.:220661.87
Organism:Homo sapiens (Human)
Description:ChEMBL_105734
Residue:1977
BDBM50105066
NameBDBM50105066
Synonyms:1-[1-(6-Chloro-benzo[1,3]dioxol-5-ylmethyl)-piperidin-4-yl]-6-methyl-1,3-dihydro-benzoimidazol-2-one | CHEMBL420863
TypeSmall organic molecule
Emp. Form.C21H22ClN3O3
Mol. Mass.399.871
SMILESCc1ccc2[nH]c(=O)n(C3CCN(Cc4cc5OCOc5cc4Cl)CC3)c2c1