Reaction Details
TargetAlpha-1A/Alpha-1B/Alpha-1D adrenergic receptor
LigandBDBM50105094
Substrate/Competitorn/a
Meas. Tech.ChEMBL_216954 (CHEMBL822772)
IC50 1330±n/a nM
Citation Poulain, RHorvath, DBonnet, BEckhoff, CChapelain, BBodinier, MCDéprez, B From hit to lead. Analyzing structure-profile relationships. J Med Chem44:3391-401 (2001) Alpha-1A/Alpha-1B/Alpha-1D adrenergic receptor
Name:Alpha-1A/Alpha-1B/Alpha-1D adrenergic receptor
Synonyms:Adrenergic receptor alpha-1
Type:n/a
Mol. Mass.:n/a
Description:ASSAY_ID of ChEMBL is 306566
Components:This complex has 3 components.
Component 1
Name:Alpha-1D adrenergic receptor
Type:Enzyme Catalytic Domain
Mol. Mass.:60485.82
Organism:Homo sapiens (Human)
Description:adrenergic Alpha1D ADRA1D HUMAN::P25100
Residue:572
Component 2
Name:Alpha-1B adrenergic receptor
Synonyms:ADA1B_HUMAN Adrenergic alpha1B Adrenergic receptor alpha Alpha 1B-adrenoreceptor | Alpha-1B adrenergic receptor
Type:Enzyme
Mol. Mass.:56862.13
Organism:Homo sapiens (Human)
Description:P35368
Residue:520
Component 3
Name:Alpha-1A adrenergic receptor
Synonyms:ADA1A_HUMAN ADRA1C Alpha 1A-adrenoceptor Alpha adrenergic receptor 1a Alpha-adrenergic receptor 1c adrenergic Alpha1 | adrenergic Alpha1C
Type:Cell-surface receptors
Mol. Mass.:51511.67
Organism:Homo sapiens (Human)
Description:P35348
Residue:466
BDBM50105094
NameBDBM50105094
Synonyms:1-[1-(6-Chloro-benzo[1,3]dioxol-5-ylmethyl)-piperidin-4-yl]-1,3-dihydro-benzoimidazol-2-one | CHEMBL114379
TypeSmall organic molecule
Emp. Form.C20H20ClN3O3
Mol. Mass.385.844
SMILESClc1cc2OCOc2cc1CN1CCC(CC1)n1c2ccccc2[nH]c1=O