Reaction Details
TargetMu-type opioid receptor
LigandBDBM50105091
Substrate/Competitorn/a
Meas. Tech.ChEMBL_149488 (CHEMBL757059)
IC50 0.900000±n/a nM
Citation Poulain, RHorvath, DBonnet, BEckhoff, CChapelain, BBodinier, MCDéprez, B From hit to lead. Analyzing structure-profile relationships. J Med Chem44:3391-401 (2001) Mu-type opioid receptor
Name:Mu-type opioid receptor
Type:G Protein-Coupled Receptor (GPCR)
Mol. Mass.:44789.51
Organism:Homo sapiens (Human)
Description:P35372
Residue:400
BDBM50105091
NameBDBM50105091
Synonyms:2-[8-(6-Chloro-benzo[1,3]dioxol-5-ylmethyl)-4-oxo-1-phenyl-1,3,8-triaza-spiro[4.5]dec-3-yl]-N-methyl-acetamide | CHEMBL115222
TypeSmall organic molecule
Emp. Form.C24H27ClN4O4
Mol. Mass.470.949
SMILESCNC(=O)CN1CN(c2ccccc2)C2(CCN(Cc3cc4OCOc4cc3Cl)CC2)C1=O