Reaction Details
TargetHistamine H2 receptor
LigandBDBM50105107
Substrate/Competitorn/a
Meas. Tech.ChEMBL_85522 (CHEMBL697133)
IC50 1980±n/a nM
Citation Poulain, RHorvath, DBonnet, BEckhoff, CChapelain, BBodinier, MCDéprez, B From hit to lead. Analyzing structure-profile relationships. J Med Chem44:3391-401 (2001) Histamine H2 receptor
Name:Histamine H2 receptor
Type:G Protein-Coupled Receptor (GPCR)
Mol. Mass.:40115.31
Organism:Homo sapiens (Human)
Description:n/a
Residue:359
BDBM50105107
NameBDBM50105107
Synonyms:1-{4-[4,4-Bis-(4-fluoro-phenyl)-butyl]-piperazin-1-yl}-4-phenyl-butan-1-one | CHEMBL117537
TypeSmall organic molecule
Emp. Form.C30H34F2N2O
Mol. Mass.476.6006
SMILESFc1ccc(cc1)C(CCCN1CCN(CC1)C(=O)CCCc1ccccc1)c1ccc(F)cc1