Reaction Details
TargetMu-type opioid receptor
LigandBDBM50105111
Substrate/Competitorn/a
Meas. Tech.ChEMBL_149488 (CHEMBL757059)
IC50 6.3±n/a nM
Citation Poulain, RHorvath, DBonnet, BEckhoff, CChapelain, BBodinier, MCDéprez, B From hit to lead. Analyzing structure-profile relationships. J Med Chem44:3391-401 (2001) Mu-type opioid receptor
Name:Mu-type opioid receptor
Type:G Protein-Coupled Receptor (GPCR)
Mol. Mass.:44789.51
Organism:Homo sapiens (Human)
Description:P35372
Residue:400
BDBM50105111
NameBDBM50105111
Synonyms:1-[1-(6-Chloro-benzo[1,3]dioxol-5-ylmethyl)-piperidin-4-yl]-1,4-dihydro-quinoxaline-2,3-dione | CHEMBL325945
TypeSmall organic molecule
Emp. Form.C21H20ClN3O4
Mol. Mass.413.854
SMILESClc1cc2OCOc2cc1CN1CCC(CC1)n1c2ccccc2[nH]c(=O)c1=O