Reaction Details
TargetD(1A) dopamine receptor
LigandBDBM50105107
Substrate/Competitorn/a
Meas. Tech.ChEMBL_60486 (CHEMBL674242)
IC50 2750±n/a nM
Citation Poulain, RHorvath, DBonnet, BEckhoff, CChapelain, BBodinier, MCDéprez, B From hit to lead. Analyzing structure-profile relationships. J Med Chem44:3391-401 (2001) D(1A) dopamine receptor
Name:D(1A) dopamine receptor
Type:Enzyme
Mol. Mass.:49303.43
Organism:Homo sapiens (Human)
Description:P21728
Residue:446
BDBM50105107
NameBDBM50105107
Synonyms:1-{4-[4,4-Bis-(4-fluoro-phenyl)-butyl]-piperazin-1-yl}-4-phenyl-butan-1-one | CHEMBL117537
TypeSmall organic molecule
Emp. Form.C30H34F2N2O
Mol. Mass.476.6006
SMILESFc1ccc(cc1)C(CCCN1CCN(CC1)C(=O)CCCc1ccccc1)c1ccc(F)cc1