Reaction Details
TargetD(3) dopamine receptor
LigandBDBM50105094
Substrate/Competitorn/a
Meas. Tech.ChEMBL_61970 (CHEMBL670426)
IC50 1910±n/a nM
Citation Poulain, RHorvath, DBonnet, BEckhoff, CChapelain, BBodinier, MCDéprez, B From hit to lead. Analyzing structure-profile relationships. J Med Chem44:3391-401 (2001) D(3) dopamine receptor
Name:D(3) dopamine receptor
Type:n/a
Mol. Mass.:44243.43
Organism:Homo sapiens (Human)
Description:n/a
Residue:400
BDBM50105094
NameBDBM50105094
Synonyms:1-[1-(6-Chloro-benzo[1,3]dioxol-5-ylmethyl)-piperidin-4-yl]-1,3-dihydro-benzoimidazol-2-one | CHEMBL114379
TypeSmall organic molecule
Emp. Form.C20H20ClN3O3
Mol. Mass.385.844
SMILESClc1cc2OCOc2cc1CN1CCC(CC1)n1c2ccccc2[nH]c1=O