Reaction Details
TargetHistamine H2 receptor
LigandBDBM50105105
Substrate/Competitorn/a
Meas. Tech.ChEMBL_85522 (CHEMBL697133)
IC50 368±n/a nM
Citation Poulain, RHorvath, DBonnet, BEckhoff, CChapelain, BBodinier, MCDéprez, B From hit to lead. Analyzing structure-profile relationships. J Med Chem44:3391-401 (2001) Histamine H2 receptor
Name:Histamine H2 receptor
Type:G Protein-Coupled Receptor (GPCR)
Mol. Mass.:40115.31
Organism:Homo sapiens (Human)
Description:n/a
Residue:359
BDBM50105105
NameBDBM50105105
Synonyms:CHEMBL116463 | {1-[4,4-Bis-(4-fluoro-phenyl)-butyl]-piperidin-4-yl}-carbamic acid 2-(4-cyano-phenyl)-ethyl ester
TypeSmall organic molecule
Emp. Form.C31H33F2N3O2
Mol. Mass.517.6094
SMILESFc1ccc(cc1)C(CCCN1CCC(CC1)NC(=O)OCCc1ccc(cc1)C#N)c1ccc(F)cc1