Reaction Details
TargetD(2) dopamine receptor
LigandBDBM50105089
Substrate/Competitorn/a
Meas. Tech.ChEMBL_59913 (CHEMBL671072)
IC50 557±n/a nM
Citation Poulain, RHorvath, DBonnet, BEckhoff, CChapelain, BBodinier, MCDéprez, B From hit to lead. Analyzing structure-profile relationships. J Med Chem44:3391-401 (2001) D(2) dopamine receptor
Name:D(2) dopamine receptor
Type:Cell-surface receptors
Mol. Mass.:50647.10
Organism:Homo sapiens (Human)
Description:P14416
Residue:443
BDBM50105089
NameBDBM50105089
Synonyms:8-Benzo[1,3]dioxol-5-ylmethyl-1-phenyl-1,3,8-triaza-spiro[4.5]decan-4-one | CHEMBL326962
TypeSmall organic molecule
Emp. Form.C21H23N3O3
Mol. Mass.365.4256
SMILESO=C1NCN(c2ccccc2)C11CCN(Cc2ccc3OCOc3c2)CC1