Reaction Details
TargetKappa-type opioid receptor
LigandBDBM50105091
Substrate/Competitorn/a
Meas. Tech.ChEMBL_145103 (CHEMBL882039)
IC50 2.1±n/a nM
Citation Poulain, RHorvath, DBonnet, BEckhoff, CChapelain, BBodinier, MCDéprez, B From hit to lead. Analyzing structure-profile relationships. J Med Chem44:3391-401 (2001) Kappa-type opioid receptor
Name:Kappa-type opioid receptor
Type:G Protein-Coupled Receptor (GPCR)
Mol. Mass.:42648.76
Organism:Homo sapiens (Human)
Description:P41145
Residue:380
BDBM50105091
NameBDBM50105091
Synonyms:2-[8-(6-Chloro-benzo[1,3]dioxol-5-ylmethyl)-4-oxo-1-phenyl-1,3,8-triaza-spiro[4.5]dec-3-yl]-N-methyl-acetamide | CHEMBL115222
TypeSmall organic molecule
Emp. Form.C24H27ClN4O4
Mol. Mass.470.949
SMILESCNC(=O)CN1CN(c2ccccc2)C2(CCN(Cc3cc4OCOc4cc3Cl)CC2)C1=O