Reaction Details
TargetD(2) dopamine receptor
LigandBDBM50105088
Substrate/Competitorn/a
Meas. Tech.ChEMBL_59913 (CHEMBL671072)
IC50 123±n/a nM
Citation Poulain, RHorvath, DBonnet, BEckhoff, CChapelain, BBodinier, MCDéprez, B From hit to lead. Analyzing structure-profile relationships. J Med Chem44:3391-401 (2001) D(2) dopamine receptor
Name:D(2) dopamine receptor
Type:Cell-surface receptors
Mol. Mass.:50647.10
Organism:Homo sapiens (Human)
Description:P14416
Residue:443
BDBM50105088
NameBDBM50105088
Synonyms:1-Phenyl-8-[1,3,4]thiadiazolo[3,4-a]pyridazin-6-ylmethyl-1,3,8-triaza-spiro[4.5]decan-4-one CHEMBL325750
TypeSmall organic molecule
Emp. Form.C20H21N5OS
Mol. Mass.379.479
SMILESO=C1NCN(c2ccccc2)C11CCN(Cc2ccc3nsnc3c2)CC1