Reaction Details
Target5-hydroxytryptamine receptor 6
LigandBDBM50105109
Substrate/Competitorn/a
Meas. Tech.ChEMBL_3607 (CHEMBL618090)
IC50 2280±n/a nM
Citation Poulain, RHorvath, DBonnet, BEckhoff, CChapelain, BBodinier, MCDéprez, B From hit to lead. Analyzing structure-profile relationships. J Med Chem44:3391-401 (2001) 5-hydroxytryptamine receptor 6
Name:5-hydroxytryptamine receptor 6
Type:G Protein-Coupled Receptor (GPCR)
Mol. Mass.:46968.43
Organism:Homo sapiens (Human)
Description:P50406
Residue:440
BDBM50105109
NameBDBM50105109
Synonyms:4-[4,4-Bis-(4-fluoro-phenyl)-butyl]-piperazine-1-carboxylic acid 2-(4-cyano-phenyl)-ethyl ester | CHEMBL326263
TypeSmall organic molecule
Emp. Form.C30H31F2N3O2
Mol. Mass.503.5828
SMILESFc1ccc(cc1)C(CCCN1CCN(CC1)C(=O)OCCc1ccc(cc1)C#N)c1ccc(F)cc1