Reaction Details
TargetKappa-type opioid receptor
LigandBDBM50105111
Substrate/Competitorn/a
Meas. Tech.ChEMBL_145103 (CHEMBL882039)
IC50 32±n/a nM
Citation Poulain, RHorvath, DBonnet, BEckhoff, CChapelain, BBodinier, MCDéprez, B From hit to lead. Analyzing structure-profile relationships. J Med Chem44:3391-401 (2001) Kappa-type opioid receptor
Name:Kappa-type opioid receptor
Type:G Protein-Coupled Receptor (GPCR)
Mol. Mass.:42648.76
Organism:Homo sapiens (Human)
Description:P41145
Residue:380
BDBM50105111
NameBDBM50105111
Synonyms:1-[1-(6-Chloro-benzo[1,3]dioxol-5-ylmethyl)-piperidin-4-yl]-1,4-dihydro-quinoxaline-2,3-dione | CHEMBL325945
TypeSmall organic molecule
Emp. Form.C21H20ClN3O4
Mol. Mass.413.854
SMILESClc1cc2OCOc2cc1CN1CCC(CC1)n1c2ccccc2[nH]c(=O)c1=O