Reaction Details
TargetKappa-type opioid receptor
LigandBDBM50105094
Substrate/Competitorn/a
Meas. Tech.ChEMBL_145103 (CHEMBL882039)
IC50 1.7±n/a nM
Citation Poulain, RHorvath, DBonnet, BEckhoff, CChapelain, BBodinier, MCDéprez, B From hit to lead. Analyzing structure-profile relationships. J Med Chem44:3391-401 (2001) Kappa-type opioid receptor
Name:Kappa-type opioid receptor
Type:G Protein-Coupled Receptor (GPCR)
Mol. Mass.:42648.76
Organism:Homo sapiens (Human)
Description:P41145
Residue:380
BDBM50105094
NameBDBM50105094
Synonyms:1-[1-(6-Chloro-benzo[1,3]dioxol-5-ylmethyl)-piperidin-4-yl]-1,3-dihydro-benzoimidazol-2-one | CHEMBL114379
TypeSmall organic molecule
Emp. Form.C20H20ClN3O3
Mol. Mass.385.844
SMILESClc1cc2OCOc2cc1CN1CCC(CC1)n1c2ccccc2[nH]c1=O