Reaction Details
TargetSodium-dependent dopamine transporter
LigandBDBM50105105
Substrate/Competitorn/a
Meas. Tech.ChEMBL_62968 (CHEMBL873582)
IC50 781±n/a nM
Citation Poulain, RHorvath, DBonnet, BEckhoff, CChapelain, BBodinier, MCDéprez, B From hit to lead. Analyzing structure-profile relationships. J Med Chem44:3391-401 (2001) Sodium-dependent dopamine transporter
Name:Sodium-dependent dopamine transporter
Type:Multi-pass membrane protein
Mol. Mass.:68497.11
Organism:Homo sapiens (Human)
Description:Q01959
Residue:620
BDBM50105105
NameBDBM50105105
Synonyms:CHEMBL116463 | {1-[4,4-Bis-(4-fluoro-phenyl)-butyl]-piperidin-4-yl}-carbamic acid 2-(4-cyano-phenyl)-ethyl ester
TypeSmall organic molecule
Emp. Form.C31H33F2N3O2
Mol. Mass.517.6094
SMILESFc1ccc(cc1)C(CCCN1CCC(CC1)NC(=O)OCCc1ccc(cc1)C#N)c1ccc(F)cc1