Reaction Details
TargetMu-type opioid receptor
LigandBDBM50105117
Substrate/Competitorn/a
Meas. Tech.ChEMBL_149488 (CHEMBL757059)
IC50 197±n/a nM
Citation Poulain, RHorvath, DBonnet, BEckhoff, CChapelain, BBodinier, MCDéprez, B From hit to lead. Analyzing structure-profile relationships. J Med Chem44:3391-401 (2001) Mu-type opioid receptor
Name:Mu-type opioid receptor
Type:G Protein-Coupled Receptor (GPCR)
Mol. Mass.:44789.51
Organism:Homo sapiens (Human)
Description:P35372
Residue:400
BDBM50105117
NameBDBM50105117
Synonyms:4-(3-Phenyl-allyl)-piperazine-1-carboxylic acid 2-(4-cyano-phenyl)-ethyl ester | CHEMBL115709
TypeSmall organic molecule
Emp. Form.C23H25N3O2
Mol. Mass.375.4635
SMILESO=C(OCCc1ccc(cc1)C#N)N1CCN(C\C=C\c2ccccc2)CC1