Reaction Details
TargetHistamine H1 receptor
LigandBDBM50105102
Substrate/Competitorn/a
Meas. Tech.ChEMBL_84419 (CHEMBL691451)
IC50 1820±n/a nM
Citation Poulain, RHorvath, DBonnet, BEckhoff, CChapelain, BBodinier, MCDéprez, B From hit to lead. Analyzing structure-profile relationships. J Med Chem44:3391-401 (2001) Histamine H1 receptor
Name:Histamine H1 receptor
Type:G Protein-Coupled Receptor (GPCR)
Mol. Mass.:55808.72
Organism:Homo sapiens (Human)
Description:Cell pellets from SK-N-MC cells transfected with human H1 receptor were used in binding assay.
Residue:487
BDBM50105102
NameBDBM50105102
Synonyms:4-[4,4-Bis-(4-fluoro-phenyl)-butyl]-piperazine-1-carboxylic acid [2-(4-ethoxy-phenyl)-ethyl]-amide | CHEMBL113956
TypeSmall organic molecule
Emp. Form.C31H37F2N3O2
Mol. Mass.521.6412
SMILESCCOc1ccc(CCNC(=O)N2CCN(CCCC(c3ccc(F)cc3)c3ccc(F)cc3)CC2)cc1