Reaction Details
TargetAdenosine deaminase
LigandBDBM50105935
Substrate/Competitorn/a
Meas. Tech.ChEMBL_30812 (CHEMBL645087)
Ki>800000±n/a nM
Citation Hakimelahi, GHLy, TWMoosavi-Movahedi, AAJain, MLZakerinia, MDavari, HMei, HCSambaiah, TMoshfegh, AAHakimelahi, S Design, synthesis, and biological evaluation of novel nucleoside and nucleotide analogues as agents against DNA viruses and/or retroviruses. J Med Chem44:3710-20 (2001) Adenosine deaminase
Name:Adenosine deaminase
Type:Enzyme
Mol. Mass.:40910.44
Organism:Bos taurus (bovine)
Description:n/a
Residue:363
BDBM50105935
NameBDBM50105935
Synonyms:CHEMBL121723 | [2-(6-Amino-purin-9-yl)-ethoxymethyl]-phosphonic acid mono-[2-(3,4-dimethoxy-5-oxo-5H-furan-2-ylidene)-ethyl] ester
TypeSmall organic molecule
Emp. Form.C16H20N5O8P
Mol. Mass.441.3325
SMILESCOC1=C(OC)\C(OC1=O)=C\COP(O)(=O)COCCn1cnc2c(N)ncnc12