Reaction Details
TargetSodium-dependent dopamine transporter
LigandBDBM22167
Substrate/Competitorn/a
Meas. Tech.ChEMBL_62335 (CHEMBL674428)
Ki 3.7±n/a nM
Citation Zhang, YJoseph, DBBowen, WDFlippen-Anderson, JLDersch, CMRothman, RBJacobson, AERice, KC Synthesis and biological evaluation of tropane-like 1-[2-[bis(4-fluorophenyl)methoxy]ethyl]-4-(3-phenylpropyl)piperazine (GBR 12909) analogues. J Med Chem44:3937-45 (2001) Sodium-dependent dopamine transporter
Name:Sodium-dependent dopamine transporter
Type:Multi-pass membrane protein
Mol. Mass.:68749.45
Organism:Rattus norvegicus (rat)
Description:P23977
Residue:619
BDBM22167
NameBDBM22167
Synonyms:1-[2-(diphenylmethoxy)ethyl]-4-(3-phenylpropyl)piperazine CHEMBL434080 GBR-12935
TypeSmall organic molecule
Emp. Form.C28H34N2O
Mol. Mass.414.5824
SMILESC(CN1CCN(CCOC(c2ccccc2)c2ccccc2)CC1)Cc1ccccc1