Reaction Details
TargetAdenosine receptor A3
LigandBDBM50097441
Substrate/Competitorn/a
Meas. Tech.ChEMBL_32009 (CHEMBL646606)
Ki 27±n/a nM
Citation van Muijlwijk-Koezen, JETimmerman, HVollinga, RCFrijtag von Drabbe Künzel, Jde Groote, MVisser, SIJzerman, AP Thiazole and thiadiazole analogues as a novel class of adenosine receptor antagonists. J Med Chem44:749-62 (2001) Adenosine receptor A3
Name:Adenosine receptor A3
Type:G Protein-Coupled Receptor (GPCR)
Mol. Mass.:36197.32
Organism:Homo sapiens (Human)
Description:P0DMS8
Residue:318
BDBM50097441
NameBDBM50097441
Synonyms:4-Methoxy-N-(2-phenyl-quinazolin-4-yl)-benzamide | CHEMBL167627
TypeSmall organic molecule
Emp. Form.C22H17N3O2
Mol. Mass.355.3893
SMILESCOc1ccc(cc1)C(=O)Nc1nc(nc2ccccc12)-c1ccccc1