Reaction Details
TargetAdenosine receptor A1
LigandBDBM50207816
Substrate/Competitorn/a
Meas. Tech.ChEMBL_29483 (CHEMBL641717)
Ki 1.2±n/a nM
Citation van Muijlwijk-Koezen, JETimmerman, HVollinga, RCFrijtag von Drabbe Künzel, Jde Groote, MVisser, SIJzerman, AP Thiazole and thiadiazole analogues as a novel class of adenosine receptor antagonists. J Med Chem44:749-62 (2001) Adenosine receptor A1
Name:Adenosine receptor A1
Type:Protein
Mol. Mass.:36704.13
Organism:Rattus norvegicus (rat)
Description:n/a
Residue:326
BDBM50207816
NameBDBM50207816
Synonyms:CHEMBL273094 N-(2-Amino-ethyl)-2-[4-(2,6-dioxo-1,3-dipropyl-2,3,6,7-tetrahydro-1H-purin-8-yl)-phenoxy]-acetamide (xanthine amine congenere, XAC) N-(2-Amino-ethyl)-2-[4-(2,6-dioxo-1,3-dipropyl-2,3,6,9-tetrahydro-1H-purin-8-yl)-phenoxy]-acetamide XAC
TypeSmall organic molecule
Emp. Form.C21H28N6O4
Mol. Mass.428.4848
SMILESCCCn1c2nc([nH]c2c(=O)n(CCC)c1=O)-c1ccc(OCC(=O)NCCN)cc1