Reaction Details
TargetAdenosine receptor A3
LigandBDBM50097446
Substrate/Competitorn/a
Meas. Tech.ChEMBL_32009 (CHEMBL646606)
Ki 79±n/a nM
Citation van Muijlwijk-Koezen, JETimmerman, HVollinga, RCFrijtag von Drabbe Künzel, Jde Groote, MVisser, SIJzerman, AP Thiazole and thiadiazole analogues as a novel class of adenosine receptor antagonists. J Med Chem44:749-62 (2001) Adenosine receptor A3
Name:Adenosine receptor A3
Type:G Protein-Coupled Receptor (GPCR)
Mol. Mass.:36197.32
Organism:Homo sapiens (Human)
Description:P0DMS8
Residue:318
BDBM50097446
NameBDBM50097446
Synonyms:4-Methoxy-N-(3-phenyl-isoquinolin-1-yl)-benzamide | CHEMBL62075
TypeSmall organic molecule
Emp. Form.C23H18N2O2
Mol. Mass.354.4012
SMILESCOc1ccc(cc1)C(=O)Nc1nc(cc2ccccc12)-c1ccccc1