Reaction Details
TargetReceptor-type tyrosine-protein phosphatase C
LigandBDBM50097530
Substrate/Competitorn/a
Meas. Tech.ChEMBL_39929 (CHEMBL655771)
IC50 9100±n/a nM
Citation Peng, HXie, WOtterness, DMCogswell, JPMcConnell, RTCarter, HLPowis, GAbraham, RTZalkow, LH Syntheses and biological activities of a novel group of steroidal derived inhibitors for human Cdc25A protein phosphatase. J Med Chem44:834-48 (2001) Receptor-type tyrosine-protein phosphatase C
Name:Receptor-type tyrosine-protein phosphatase C
Type:Protein
Mol. Mass.:147474.19
Organism:Homo sapiens (Human)
Description:P08575
Residue:1306
BDBM50097530
NameBDBM50097530
Synonyms:CHEMBL168868 | [5-(5-Cyano-1-methyl-pentyl)-1-(1,5-dimethyl-hexyl)-7a-methyl-octahydro-inden-4-yl]-acetic acid
TypeSmall organic molecule
Emp. Form.C27H47NO2
Mol. Mass.417.6676
SMILESCC(C)CCCC(C)[C@H]1CC[C@H]2[C@H](CC(O)=O)[C@H](CC[C@]12C)C(C)CCCCC#N