Reaction Details
TargetCell division control protein 45 homolog
LigandBDBM50097534
Substrate/Competitorn/a
Meas. Tech.ChEMBL_49200 (CHEMBL662921)
IC50>100000±n/a nM
Citation Peng, HXie, WOtterness, DMCogswell, JPMcConnell, RTCarter, HLPowis, GAbraham, RTZalkow, LH Syntheses and biological activities of a novel group of steroidal derived inhibitors for human Cdc25A protein phosphatase. J Med Chem44:834-48 (2001) Cell division control protein 45 homolog
Name:Cell division control protein 45 homolog
Type:PROTEIN
Mol. Mass.:65553.79
Organism:Homo sapiens (Human)
Description:ChEMBL_49200
Residue:566
BDBM50097534
NameBDBM50097534
Synonyms:5-[3-(1,5-Dimethyl-hexyl)-3a,6-dimethyl-8-oxo-dodecahydro-7-oxa-cyclopenta[a]naphthalen-6-yl]-pentanoic acid | CHEMBL354296
TypeSmall organic molecule
Emp. Form.C27H46O4
Mol. Mass.434.6517
SMILESCC(C)CCC[C@@H](C)[C@H]1CC[C@H]2[C@@H]3CC(=O)O[C@](C)(CCCCC(O)=O)[C@H]3CC[C@]12C