Reaction Details
TargetCell division control protein 45 homolog
LigandBDBM50097530
Substrate/Competitorn/a
Meas. Tech.ChEMBL_49200 (CHEMBL662921)
IC50 8600±n/a nM
Citation Peng, HXie, WOtterness, DMCogswell, JPMcConnell, RTCarter, HLPowis, GAbraham, RTZalkow, LH Syntheses and biological activities of a novel group of steroidal derived inhibitors for human Cdc25A protein phosphatase. J Med Chem44:834-48 (2001) Cell division control protein 45 homolog
Name:Cell division control protein 45 homolog
Type:PROTEIN
Mol. Mass.:65553.79
Organism:Homo sapiens (Human)
Description:ChEMBL_49200
Residue:566
BDBM50097530
NameBDBM50097530
Synonyms:CHEMBL168868 | [5-(5-Cyano-1-methyl-pentyl)-1-(1,5-dimethyl-hexyl)-7a-methyl-octahydro-inden-4-yl]-acetic acid
TypeSmall organic molecule
Emp. Form.C27H47NO2
Mol. Mass.417.6676
SMILESCC(C)CCCC(C)[C@H]1CC[C@H]2[C@H](CC(O)=O)[C@H](CC[C@]12C)C(C)CCCCC#N