Reaction Details
TargetChymase
LigandBDBM50098864
Substrate/Competitorn/a
Meas. Tech.ChEMBL_197663 (CHEMBL872602)
Ki 41.8±n/a nM
Citation Akahoshi, FAshimori, ASakashita, HYoshimura, TImada, TNakajima, MMitsutomi, NKuwahara, SOhtsuka, TFukaya, CMiyazaki, MNakamura, N Synthesis, structure-activity relationships, and pharmacokinetic profiles of nonpeptidic alpha-keto heterocycles as novel inhibitors of human chymase. J Med Chem44:1286-96 (2001) Chymase
Name:Chymase
Type:Enzyme
Mol. Mass.:27340.12
Organism:Homo sapiens (Human)
Description:n/a
Residue:247
BDBM50098864
NameBDBM50098864
Synonyms:2-(2-{2-[5-Amino-2-(3-nitro-phenyl)-6-oxo-6H-pyrimidin-1-yl]-acetylamino}-3-phenyl-propionyl)-benzooxazole-5-carboxylic acid methyl ester | CHEMBL284350
TypeSmall organic molecule
Emp. Form.C30H24N6O8
Mol. Mass.596.547
SMILESCOC(=O)c1ccc2oc(nc2c1)C(=O)C(Cc1ccccc1)NC(=O)Cn1c(ncc(N)c1=O)-c1cccc(c1)[N+]([O-])=O