Reaction Details
TargetMast cell protease 9
LigandBDBM50098853
Substrate/Competitorn/a
Meas. Tech.ChEMBL_217040 (CHEMBL821574)
Ki 63.9±n/a nM
Citation Akahoshi, FAshimori, ASakashita, HYoshimura, TImada, TNakajima, MMitsutomi, NKuwahara, SOhtsuka, TFukaya, CMiyazaki, MNakamura, N Synthesis, structure-activity relationships, and pharmacokinetic profiles of nonpeptidic alpha-keto heterocycles as novel inhibitors of human chymase. J Med Chem44:1286-96 (2001) Mast cell protease 9
Name:Mast cell protease 9
Type:PROTEIN
Mol. Mass.:26672.66
Organism:Mus musculus
Description:ChEMBL_217041
Residue:246
BDBM50098853
NameBDBM50098853
Synonyms:2-(2-{2-[5-Amino-2-(3-methoxy-phenyl)-6-oxo-6H-pyrimidin-1-yl]-acetylamino}-3-phenyl-propionyl)-benzooxazole-5-carboxylic acid methyl ester | CHEMBL26285
TypeSmall organic molecule
Emp. Form.C31H27N5O7
Mol. Mass.581.5754
SMILESCOC(=O)c1ccc2oc(nc2c1)C(=O)C(Cc1ccccc1)NC(=O)Cn1c(ncc(N)c1=O)-c1cccc(OC)c1