Reaction Details
TargetChymotrypsin-C
LigandBDBM87059
Substrate/Competitorn/a
Meas. Tech.ChEMBL_49624 (CHEMBL663104)
Ki 9.360±n/a nM
Citation Akahoshi, FAshimori, ASakashita, HYoshimura, TImada, TNakajima, MMitsutomi, NKuwahara, SOhtsuka, TFukaya, CMiyazaki, MNakamura, N Synthesis, structure-activity relationships, and pharmacokinetic profiles of nonpeptidic alpha-keto heterocycles as novel inhibitors of human chymase. J Med Chem44:1286-96 (2001) Chymotrypsin-C
Name:Chymotrypsin-C
Type:Enzyme
Mol. Mass.:29487.98
Organism:Homo sapiens (Human)
Description:Q99895
Residue:268
BDBM87059
NameBDBM87059
Synonyms:CHEMBL247767 | Chymostatin
TypeSmall organic molecule
Emp. Form.C31H41N7O6
Mol. Mass.607.7005
SMILESCC(C)C[C@H](NC(=O)[C@@H](NC(=O)N[C@@H](Cc1ccccc1)C(O)=O)C1CCNC(N)=N1)C(=O)N[C@@H](Cc1ccccc1)C=O