Reaction Details
TargetMu-type opioid receptor
LigandBDBM50098673
Substrate/Competitorn/a
Meas. Tech.ChEMBL_149626 (CHEMBL758050)
Ki 200±n/a nM
Citation McLamore, SUllrich, TRothman, RBXu, HDersch, CCoop, ADavis, PPorreca, FJacobson, AERice, KC Effect of N-alkyl and N-alkenyl substituents in noroxymorphindole, 17-substituted-6,7-dehydro-4,5alpha-epoxy-3,14-dihydroxy-6,7:2',3'-indolomorphinans, on opioid receptor affinity, selectivity, and efficacy. J Med Chem44:1471-4 (2001) Mu-type opioid receptor
Name:Mu-type opioid receptor
Type:G Protein-Coupled Receptor (GPCR)
Mol. Mass.:44503.11
Organism:Rattus norvegicus (rat)
Description:Competition binding assays were carried out using membrane preparations from transfected HN9.10 cells that constitutively expressed the mu opioid receptor.
Residue:398
BDBM50098673
NameBDBM50098673
Synonyms:17-(2-methyl-2-propenyl)-6,7-dehydro-4,5alpha-epoxy-3,14-dihydroxy-6,7:2',3'-indolomorphinan
TypeSmall organic molecule
Emp. Form.C25H24N2O3
Mol. Mass.400.4697
SMILESCC(=C)N1CC[C@@]23[C@H]4Oc5c2c(CC1[C@]3(O)Cc1c4[nH]c2ccccc12)ccc5O