Reaction Details
TargetP2Y purinoceptor 2
LigandBDBM50306712
Substrate/Competitorn/a
Meas. Tech.ChEMBL_147745 (CHEMBL753285)
EC50 15.9±n/a nM
Citation Kim, HSRavi, RGMarquez, VEMaddileti, SWihlborg, AKErlinge, DMalmsjö, MBoyer, JLHarden, TKJacobson, KA Methanocarba modification of uracil and adenine nucleotides: high potency of Northern ring conformation at P2Y1, P2Y2, P2Y4, and P2Y11 but not P2Y6 receptors. J Med Chem45:208-18 (2001) P2Y purinoceptor 2
Name:P2Y purinoceptor 2
Type:PROTEIN
Mol. Mass.:42299.21
Organism:Homo sapiens (Human)
Description:ChEMBL_1455361
Residue:377
BDBM50306712
NameBDBM50306712
Synonyms:((1R,2R,3S,4R,5S)-4-(2,4-dioxo-3,4-dihydropyrimidin-1(2H)-yl)-2,3-dihydroxybicyclo[3.1.0]hexan-1-yl)methyl tetrahydrogen triphosphate | CHEMBL606210
TypeSmall organic molecule
Emp. Form.C11H17N2O14P3
Mol. Mass.494.179
SMILESO[C@@H]1[C@H](O)[C@]2(COP(O)(=O)OP(O)(=O)OP(O)(O)=O)C[C@@H]2[C@H]1n1ccc(=O)[nH]c1=O