Reaction Details
TargetP2Y purinoceptor 11
LigandBDBM50409486
Substrate/Competitorn/a
Meas. Tech.ChEMBL_147735 (CHEMBL755046)
EC50 17250±n/a nM
Citation Kim, HSRavi, RGMarquez, VEMaddileti, SWihlborg, AKErlinge, DMalmsjö, MBoyer, JLHarden, TKJacobson, KA Methanocarba modification of uracil and adenine nucleotides: high potency of Northern ring conformation at P2Y1, P2Y2, P2Y4, and P2Y11 but not P2Y6 receptors. J Med Chem45:208-18 (2001) P2Y purinoceptor 11
Name:P2Y purinoceptor 11
Type:PROTEIN
Mol. Mass.:40366.02
Organism:Homo sapiens (Human)
Description:ChEMBL_1362532
Residue:374
BDBM50409486
NameBDBM50409486
Synonyms:CHEMBL2111533
TypeSmall organic molecule
Emp. Form.C12H18N5O12P3
Mol. Mass.517.2189
SMILESNc1ncnc2n(cnc12)[C@@H]1[C@H]2C[C@@]2(COP(O)(=O)OP(O)(=O)OP(O)(O)=O)[C@@H](O)[C@H]1O