Reaction Details
TargetCoagulation factor X
LigandBDBM50113865
Substrate/Competitorn/a
Meas. Tech.ChEMBL_49312 (CHEMBL663411)
Ki 23±n/a nM
Citation Phillips, GGuilford, WJBuckman, BODavey, DDEagen, KAKoovakkat, SLiang, AMcCarrick, MMohan, RNg, HPPinkerton, MSubramanyam, BHo, ETrinh, LWhitlow, MWu, SXu, WMorrissey, MM Design, synthesis, and activity of a novel series of factor Xa inhibitors: optimization of arylamidine groups. J Med Chem45:2484-93 (2002) Coagulation factor X
Name:Coagulation factor X
Type:Enzyme
Mol. Mass.:54726.60
Organism:Homo sapiens (Human)
Description:n/a
Residue:488
BDBM50113865
NameBDBM50113865
Synonyms:3-[6-(5-Carbamimidoyl-2,3-dihydroxy-phenoxy)-3,5-difluoro-4-methyl-pyridin-2-yloxy]-N,N-dimethyl-benzamide | CHEMBL82456
TypeSmall organic molecule
Emp. Form.C22H20F2N4O5
Mol. Mass.458.4148
SMILESCN(C)C(=O)c1cccc(Oc2nc(Oc3cc(cc(O)c3O)C(N)=N)c(F)c(C)c2F)c1