Reaction Details
TargetCoagulation factor X
LigandBDBM50066617
Substrate/Competitorn/a
Meas. Tech.ChEMBL_49312 (CHEMBL663411)
Ki 26±n/a nM
Citation Phillips, GGuilford, WJBuckman, BODavey, DDEagen, KAKoovakkat, SLiang, AMcCarrick, MMohan, RNg, HPPinkerton, MSubramanyam, BHo, ETrinh, LWhitlow, MWu, SXu, WMorrissey, MM Design, synthesis, and activity of a novel series of factor Xa inhibitors: optimization of arylamidine groups. J Med Chem45:2484-93 (2002) Coagulation factor X
Name:Coagulation factor X
Type:Enzyme
Mol. Mass.:54726.60
Organism:Homo sapiens (Human)
Description:n/a
Residue:488
BDBM50066617
NameBDBM50066617
Synonyms:2-(5-Carbamimidoyl-2-hydroxy-phenoxy)-6-(3-imidazol-1-yl-phenoxy)-isonicotinic acid | CHEMBL310373
TypeSmall organic molecule
Emp. Form.C22H17N5O5
Mol. Mass.431.4009
SMILESNC(=N)c1ccc(O)c(Oc2cc(cc(Oc3cccc(c3)-n3ccnc3)n2)C(O)=O)c1