Reaction Details
TargetCoagulation factor X
LigandBDBM50066637
Substrate/Competitorn/a
Meas. Tech.ChEMBL_49312 (CHEMBL663411)
Ki 2.4±n/a nM
Citation Phillips, GGuilford, WJBuckman, BODavey, DDEagen, KAKoovakkat, SLiang, AMcCarrick, MMohan, RNg, HPPinkerton, MSubramanyam, BHo, ETrinh, LWhitlow, MWu, SXu, WMorrissey, MM Design, synthesis, and activity of a novel series of factor Xa inhibitors: optimization of arylamidine groups. J Med Chem45:2484-93 (2002) Coagulation factor X
Name:Coagulation factor X
Type:Enzyme
Mol. Mass.:54726.60
Organism:Homo sapiens (Human)
Description:n/a
Residue:488
BDBM50066637
NameBDBM50066637
Synonyms:2-(5-Carbamimidoyl-2-hydroxy-phenoxy)-6-[3-(1-methyl-4,5-dihydro-1H-imidazol-2-yl)-phenoxy]-isonicotinic acid | CHEMBL84065
TypeSmall organic molecule
Emp. Form.C23H21N5O5
Mol. Mass.447.4433
SMILESCN1CCN=C1c1cccc(Oc2cc(cc(Oc3cc(ccc3O)C(N)=N)n2)C(O)=O)c1