Reaction Details
TargetVasopressin V2 receptor
LigandBDBM50205990
Substrate/Competitorn/a
Meas. Tech.ChEMBL_214719 (CHEMBL873236)
Ki 3500±n/a nM
Citation Terrillon, SCheng, LLStoev, SMouillac, BBarberis, CManning, MDurroux, T Synthesis and characterization of fluorescent antagonists and agonists for human oxytocin and vasopressin V(1)(a) receptors. J Med Chem45:2579-88 (2002) Vasopressin V2 receptor
Name:Vasopressin V2 receptor
Type:Receptor
Mol. Mass.:40295.28
Organism:Homo sapiens (Human)
Description:P30518
Residue:371
BDBM50205990
NameBDBM50205990
Synonyms:CHEMBL395429 | OXYTOCIN
TypeSmall organic molecule
Emp. Form.C43H66N12O12S2
Mol. Mass.1007.187
SMILESCC[C@H](C)[C@@H]1NC(=O)[C@H](Cc2ccc(O)cc2)NC(=O)[C@@H](N)CSSC[C@H](NC(=O)[C@H](CC(N)=O)NC(=O)[C@H](CCC(N)=O)NC1=O)C(=O)N1CCC[C@H]1C(=O)N[C@@H](CC(C)C)C(=O)NCC(N)=O