Reaction Details
TargetMelanocortin receptor 3
LigandBDBM50114084
Substrate/Competitorn/a
Meas. Tech.ChEMBL_106832 (CHEMBL717673)
Ki 7.8±n/a nM
Citation Kavarana, MJTrivedi, DCai, MYing, JHammer, MCabello, CGrieco, PHan, GHruby, VJ Novel cyclic templates of alpha-MSH give highly selective and potent antagonists/agonists for human melanocortin-3/4 receptors. J Med Chem45:2644-50 (2002) Melanocortin receptor 3
Name:Melanocortin receptor 3
Type:Enzyme
Mol. Mass.:36044.86
Organism:Homo sapiens (Human)
Description:P41968
Residue:323
BDBM50114084
NameBDBM50114084
Synonyms:(O)C-(C6H4)-C(O)-c[His-D-Nal(2')-Arg-Trp-Lys]-NH2) (MK-7) | CHEMBL439188
TypeSmall organic molecule
Emp. Form.C50H57N13O7
Mol. Mass.952.0705
SMILESNC(=N)NCCC[C@@H]1NC(=O)[C@@H](Cc2ccc3ccccc3c2)NC(=O)[C@H](Cc2cnc[nH]2)NC(=O)c2ccccc2C(=O)NCCCC[C@@H](NC(=O)[C@@H](Cc2c[nH]c3ccccc23)NC1=O)C(N)=O