Reaction Details
TargetMelanocortin receptor 3
LigandBDBM50114083
Substrate/Competitorn/a
Meas. Tech.ChEMBL_106829 (CHEMBL717670)
EC50 1000±n/a nM
Citation Kavarana, MJTrivedi, DCai, MYing, JHammer, MCabello, CGrieco, PHan, GHruby, VJ Novel cyclic templates of alpha-MSH give highly selective and potent antagonists/agonists for human melanocortin-3/4 receptors. J Med Chem45:2644-50 (2002) Melanocortin receptor 3
Name:Melanocortin receptor 3
Type:Enzyme
Mol. Mass.:36044.86
Organism:Homo sapiens (Human)
Description:P41968
Residue:323
BDBM50114083
NameBDBM50114083
Synonyms:9-Benzyl-12-(3H-imidazol-4-ylmethyl)-3-(1H-indol-3-ylmethyl)-6-methyl-2,5,8,11,14,17-hexaoxo-1,4,7,10,13,18hexaaza-cyclotricosane-23-carboxylic acid amide | CHEMBL315397
TypeSmall organic molecule
Emp. Form.C39H48N10O7
Mol. Mass.768.8612
SMILESC[C@@H]1NC(=O)[C@@H](Cc2ccccc2)NC(=O)[C@H](Cc2cnc[nH]2)NC(=O)CCC(=O)NCCCC[C@@H](NC(=O)[C@@H](Cc2c[nH]c3ccccc23)NC1=O)C(N)=O