Reaction Details
TargetMelanocortin receptor 3
LigandBDBM50114085
Substrate/Competitorn/a
Meas. Tech.ChEMBL_106829 (CHEMBL717670)
EC50 13±n/a nM
Citation Kavarana, MJTrivedi, DCai, MYing, JHammer, MCabello, CGrieco, PHan, GHruby, VJ Novel cyclic templates of alpha-MSH give highly selective and potent antagonists/agonists for human melanocortin-3/4 receptors. J Med Chem45:2644-50 (2002) Melanocortin receptor 3
Name:Melanocortin receptor 3
Type:Enzyme
Mol. Mass.:36044.86
Organism:Homo sapiens (Human)
Description:P41968
Residue:323
BDBM50114085
NameBDBM50114085
Synonyms:(O)C-(C6H4)-C(O)-c[His-D-Phe-Arg-Trp-Lys]-NH2) (MK-6) | CHEMBL314401
TypeSmall organic molecule
Emp. Form.C46H55N13O7
Mol. Mass.902.0118
SMILESNC(=N)NCCC[C@@H]1NC(=O)[C@@H](Cc2ccccc2)NC(=O)[C@H](Cc2cnc[nH]2)NC(=O)c2ccccc2C(=O)NCCCC[C@@H](NC(=O)[C@@H](Cc2c[nH]c3ccccc23)NC1=O)C(N)=O