Reaction Details
TargetSodium/hydrogen exchanger 1
LigandBDBM50115235
Substrate/Competitorn/a
Meas. Tech.ChEMBL_141044 (CHEMBL746892)
IC50 82±n/a nM
Citation Fukumoto, SImamiya, EKusumoto, KFujiwara, SWatanabe, TShiraishi, M Novel, non-acylguanidine-type Na(+)/H(+) exchanger inhibitors: synthesis and pharmacology of 5-tetrahydroquinolinylidene aminoguanidine derivatives. J Med Chem45:3009-21 (2002) Sodium/hydrogen exchanger 1
Name:Sodium/hydrogen exchanger 1
Type:PROTEIN
Mol. Mass.:91655.00
Organism:Rattus norvegicus
Description:ChEMBL_862370
Residue:820
BDBM50115235
NameBDBM50115235
Synonyms:CHEMBL541833 | N-[6-(2-chlorophenyl)-3-methyl-4,5,6,7-tetrahydrobenzo[b]furan-4-yliden(imine)]iminomethanediamine. hydrochloride
TypeSmall organic molecule
Emp. Form.C16H17ClN4O
Mol. Mass.316.785
SMILES[#6]-c1coc2-[#6]-[#6](-[#6]-[#6](=[#7]\[#7]=[#6](\[#7])-[#7])-c12)-c1ccccc1Cl