Reaction Details
TargetSodium/hydrogen exchanger 1
LigandBDBM50115252
Substrate/Competitorn/a
Meas. Tech.ChEMBL_141044 (CHEMBL746892)
IC50 47±n/a nM
Citation Fukumoto, SImamiya, EKusumoto, KFujiwara, SWatanabe, TShiraishi, M Novel, non-acylguanidine-type Na(+)/H(+) exchanger inhibitors: synthesis and pharmacology of 5-tetrahydroquinolinylidene aminoguanidine derivatives. J Med Chem45:3009-21 (2002) Sodium/hydrogen exchanger 1
Name:Sodium/hydrogen exchanger 1
Type:PROTEIN
Mol. Mass.:91655.00
Organism:Rattus norvegicus
Description:ChEMBL_862370
Residue:820
BDBM50115252
NameBDBM50115252
Synonyms:CHEMBL552827 | N-[4-methyl-7-(2-thienyl)-5,6,7,8-tetrahydro-5-quinolinyliden(imine)]iminomethanediamine. dihydrochloride
TypeSmall organic molecule
Emp. Form.C15H17N5S
Mol. Mass.299.394
SMILES[#6]-c1ccnc2-[#6]-[#6](-[#6]-[#6](=[#7]\[#7]=[#6](\[#7])-[#7])-c12)-c1cccs1