Reaction Details
TargetSodium/hydrogen exchanger 1
LigandBDBM50115269
Substrate/Competitorn/a
Meas. Tech.ChEMBL_141044 (CHEMBL746892)
IC50 89±n/a nM
Citation Fukumoto, SImamiya, EKusumoto, KFujiwara, SWatanabe, TShiraishi, M Novel, non-acylguanidine-type Na(+)/H(+) exchanger inhibitors: synthesis and pharmacology of 5-tetrahydroquinolinylidene aminoguanidine derivatives. J Med Chem45:3009-21 (2002) Sodium/hydrogen exchanger 1
Name:Sodium/hydrogen exchanger 1
Type:PROTEIN
Mol. Mass.:91655.00
Organism:Rattus norvegicus
Description:ChEMBL_862370
Residue:820
BDBM50115269
NameBDBM50115269
Synonyms:CHEMBL554686 | N-[7-(2,3-dichlorophenyl)-4-methyl-5,6,7,8-tetrahydro-5-quinolinyliden(imine)]iminomethanediamine. dihydrochloride
TypeSmall organic molecule
Emp. Form.C17H17Cl2N5
Mol. Mass.362.256
SMILES[#6]-c1ccnc2-[#6]-[#6](-[#6]-[#6](=[#7]\[#7]=[#6](\[#7])-[#7])-c12)-c1cccc(Cl)c1Cl