Reaction Details
TargetPlatelet-derived growth factor receptor beta
LigandBDBM50117330
Substrate/Competitorn/a
Meas. Tech.ChEMBL_158652 (CHEMBL763438)
IC50 80±n/a nM
Citation Pandey, AVolkots, DLSeroogy, JMRose, JWYu, JCLambing, JLHutchaleelaha, AHollenbach, SJAbe, KGiese, NAScarborough, RM Identification of orally active, potent, and selective 4-piperazinylquinazolines as antagonists of the platelet-derived growth factor receptor tyrosine kinase family. J Med Chem45:3772-93 (2002) Platelet-derived growth factor receptor beta
Name:Platelet-derived growth factor receptor beta
Type:Enzyme
Mol. Mass.:123922.25
Organism:Homo sapiens (Human)
Description:P09619
Residue:1106
BDBM50117330
NameBDBM50117330
Synonyms:4-[6,7-Bis-(2-methoxy-ethoxy)-quinazolin-4-yl]-piperazine-1-carboxylic acid (4-tert-butyl-phenyl)-amide | CHEMBL341258
TypeSmall organic molecule
Emp. Form.C29H39N5O5
Mol. Mass.537.6505
SMILESCOCCOc1cc2ncnc(N3CCN(CC3)C(=O)Nc3ccc(cc3)C(C)(C)C)c2cc1OCCOC