Reaction Details
TargetPlatelet-derived growth factor receptor beta
LigandBDBM50117328
Substrate/Competitorn/a
Meas. Tech.ChEBML_158654
IC50 29±n/a nM
Citation Pandey, AVolkots, DLSeroogy, JMRose, JWYu, JCLambing, JLHutchaleelaha, AHollenbach, SJAbe, KGiese, NAScarborough, RM Identification of orally active, potent, and selective 4-piperazinylquinazolines as antagonists of the platelet-derived growth factor receptor tyrosine kinase family. J Med Chem45:3772-93 (2002) Platelet-derived growth factor receptor beta
Name:Platelet-derived growth factor receptor beta
Type:Enzyme
Mol. Mass.:123922.25
Organism:Homo sapiens (Human)
Description:P09619
Residue:1106
BDBM50117328
NameBDBM50117328
Synonyms:4-{7-[3-(3,3-Difluoro-piperidin-1-yl)-propoxy]-6-methoxy-quinazolin-4-yl}-piperazine-1-carboxylic acid (4-isopropoxy-phenyl)-amide | CHEMBL125431
TypeSmall organic molecule
Emp. Form.C31H40F2N6O4
Mol. Mass.598.6839
SMILESCOc1cc2c(ncnc2cc1OCCCN1CCCC(F)(F)C1)N1CCN(CC1)C(=O)Nc1ccc(OC(C)C)cc1